Target
Potassium voltage-gated channel subfamily H member 2
Ligand
BDBM466957
Substrate
Meas. Tech.
hERG Potassium Channel Toxicity Assay
IC50
13440±n/a nM
Citation
 Liu, HZhou, YXia, WZhang, DJiang, HChen, K Fluorine-containing triazolopyridine, and manufacturing method, pharmaceutical composition, and application thereof US Patent  US10800776 Publication Date 10/13/2020 
Target
Name:
Potassium voltage-gated channel subfamily H member 2
Synonyms:
1,3-beta-glucan synthase component GLS2 ERG Eag-related protein 1 Ether-a-go-go-related gene (HERG) Ether-a-go-go-related gene potassium channel 1 Ether-a-go-go-related gene potassium channel 1 (hERG1) Ether-a-go-go-related protein 1 H-ERG KCNH2 Potassium voltage-gated channel subfamily H member 2 (hERG) Voltage-gated potassium channel subunit Kv11.1 hERG Potassium Channel 1 | putative potassium channel subunit
Type:
Multi-pass membrane protein
Mol. Mass.:
126672.65
Organism:
Homo sapiens (Human)
Description:
Q12809
Residue:
1159
  
Inhibitor
Name:
BDBM466957
Synonyms:
Methyl 4-(8-Chloro-3- ((2,2-difluorocyclopropyl) methyl)-[1,2,4]triazole[4,3-a] pyridin-7-yl)-3-fluorobenzoate | US10800776, Example 45
Type:
Small organic molecule
Emp. Form.:
C18H13ClF3N3O2
Mol. Mass.:
395.763
SMILES:
COC(=O)c1ccc(c(F)c1)-c1ccn2c(CC3CC3(F)F)nnc2c1Cl
: