Target
Beta-lactamase TEM
Ligand
BDBM466978
Substrate
Meas. Tech.
Inhibition of Beta-Lactamase Enzymes
IC50
93.0±n/a nM
Citation
 Comita-Prevoir, JDurand-Reville, TFGauthier, LO''Donnell, JRomero, JTommasi, RVerheijen, JCWu, FWu, XZhang, J Beta-lactamase inhibitor compounds US Patent  US10800778 Publication Date 10/13/2020 
Target
Name:
Beta-lactamase TEM
Synonyms:
BLAT_ECOLX Beta-lactamase (TEM-1) Beta-lactamase TEM-1 Beta-lactamase TEM1D Beta-lactamase TEM1F TEM extended-spectrum beta-lactamase bla
Type:
Enzyme
Mol. Mass.:
31512.33
Organism:
Escherichia coli
Description:
P62593
Residue:
286
  
Inhibitor
Name:
BDBM466978
Synonyms:
(2S)-2-fluoro-2-[[(2S,5R)-3-methyl-7-oxo-2-(2-sulfamoylethoxycarbamoyl)-1,6-diazabicyclo[3.2.1]oct-3-en-6-yl]oxy]acetic acid lithium salt | US10800778, Example 56
Type:
Small organic molecule
Emp. Form.:
C12H17FN4O8S
Mol. Mass.:
396.349
SMILES:
CC1=C[C@@H]2CN([C@@H]1C(=O)NOCCS(N)(=O)=O)C(=O)N2O[C@@H](F)C(O)=O
: