Target
Beta-lactamase
Ligand
BDBM466986
Substrate
Meas. Tech.
Inhibition of Beta-Lactamase Enzymes
IC50
130±n/a nM
Citation
 Comita-Prevoir, JDurand-Reville, TFGauthier, LO''Donnell, JRomero, JTommasi, RVerheijen, JCWu, FWu, XZhang, J Beta-lactamase inhibitor compounds US Patent  US10800778 Publication Date 10/13/2020 
Target
Name:
Beta-lactamase
Synonyms:
AMPC_ECOLI Beta-lactamase (AmpC) Cephalosporinase ampA | ampC
Type:
Protien
Mol. Mass.:
41561.62
Organism:
Escherichia coli
Description:
P00811
Residue:
377
  
Inhibitor
Name:
BDBM466986
Synonyms:
(2S)-2-[[(2S,5R)-2-(cyclopropylmethoxycarbamoyl)-3-methyl-7-oxo-1,6-diazabicyclo[3.2.1]oct-3-en-6-yl]oxy]-2-fluoro-acetic acid lithium salt | US10800778, Example 70
Type:
Small organic molecule
Emp. Form.:
C14H18FN3O6
Mol. Mass.:
343.3076
SMILES:
CC1=C[C@@H]2CN([C@@H]1C(=O)NOCC1CC1)C(=O)N2O[C@@H](F)C(O)=O
: