Target
Lysine-specific histone demethylase 1A
Ligand
BDBM388918
Substrate
Meas. Tech.
LSD1 histone demethylase biochemical assay
IC50
<50±n/a nM
Citation
 He, CLi, ZWu, LYao, WZhang, F Heterocyclic compounds as LSD1 inhibitors US Patent  US10800779 Publication Date 10/13/2020 
Target
Name:
Lysine-specific histone demethylase 1A
Synonyms:
AOF2 Flavin-containing amine oxidase domain-containing protein 2 KDM1A KIAA0601 Lysine-specific demethylase 1 (LSD1) Lysine-specific histone demethylase 1 (LSD1)
Type:
Enzyme
Mol. Mass.:
92901.01
Organism:
Homo sapiens (Human)
Description:
O60341
Residue:
852
  
Inhibitor
Name:
BDBM388918
Synonyms:
4-[5-(7-methyl-2,7-diazaspiro[4.4]non-2-yl)-8-(1-methyl-1H-pyrazolo[3,4-b]pyridin-5-yl)imidazo[1,2-c]pyrimidin-7-yl]benzonitrile US11401272, Example 39 | US9944647, Example 39
Type:
Small organic molecule
Emp. Form.:
C28H27N9
Mol. Mass.:
489.5743
SMILES:
CN1CCC2(CCN(C2)c2nc(-c3ccc(cc3)C#N)c(-c3cnc4n(C)ncc4c3)c3nccn23)C1
: