Target
Lysine-specific histone demethylase 1A
Ligand
BDBM388935
Substrate
Meas. Tech.
LSD1 histone demethylase biochemical assay
IC50
<50±n/a nM
Citation
 He, CLi, ZWu, LYao, WZhang, F Heterocyclic compounds as LSD1 inhibitors US Patent  US10800779 Publication Date 10/13/2020 
Target
Name:
Lysine-specific histone demethylase 1A
Synonyms:
AOF2 Flavin-containing amine oxidase domain-containing protein 2 KDM1A KIAA0601 Lysine-specific demethylase 1 (LSD1) Lysine-specific histone demethylase 1 (LSD1)
Type:
Enzyme
Mol. Mass.:
92901.01
Organism:
Homo sapiens (Human)
Description:
O60341
Residue:
852
  
Inhibitor
Name:
BDBM388935
Synonyms:
4-[5-[4-(dimethylamino)piperidin-1-yl]-8-(5-fluoro-3-methyl-2-oxo-2,3-dihydro-1,3-benzoxazol-6-yl)imidazo[1,2-c]pyrimidin-7-yl]benzonitrile US11401272, Example 54 | US9944647, Example 54
Type:
Small organic molecule
Emp. Form.:
C28H26FN7O2
Mol. Mass.:
511.5501
SMILES:
CN(C)C1CCN(CC1)c1nc(-c2ccc(cc2)C#N)c(-c2cc3oc(=O)n(C)c3cc2F)c2nccn12
: