Target
Lysine-specific histone demethylase 1A
Ligand
BDBM389013
Substrate
Meas. Tech.
LSD1 histone demethylase biochemical assay
IC50
<50±n/a nM
Citation
 He, CLi, ZWu, LYao, WZhang, F Heterocyclic compounds as LSD1 inhibitors US Patent  US10800779 Publication Date 10/13/2020 
Target
Name:
Lysine-specific histone demethylase 1A
Synonyms:
AOF2 Flavin-containing amine oxidase domain-containing protein 2 KDM1A KIAA0601 Lysine-specific demethylase 1 (LSD1) Lysine-specific histone demethylase 1 (LSD1)
Type:
Enzyme
Mol. Mass.:
92901.01
Organism:
Homo sapiens (Human)
Description:
O60341
Residue:
852
  
Inhibitor
Name:
BDBM389013
Synonyms:
4-[5-[4-(dimethylamino)piperidin-1- yl]-8-(2-hydroxy-2,3-dihydro-1H- inden-5-yl)imidazo[1,2-c]pyrimidin- 7-yl]benzonitrile US11401272, Example 122 | US9944647, Example 122
Type:
Small organic molecule
Emp. Form.:
C29H30N6O
Mol. Mass.:
478.5881
SMILES:
CN(C)C1CCN(CC1)c1nc(-c2ccc(cc2)C#N)c(-c2ccc3CC(O)Cc3c2)c2nccn12
: