Target
Lysine-specific histone demethylase 1A
Ligand
BDBM389025
Substrate
Meas. Tech.
LSD1 histone demethylase biochemical assay
IC50
<50±n/a nM
Citation
 He, CLi, ZWu, LYao, WZhang, F Heterocyclic compounds as LSD1 inhibitors US Patent  US10800779 Publication Date 10/13/2020 
Target
Name:
Lysine-specific histone demethylase 1A
Synonyms:
AOF2 Flavin-containing amine oxidase domain-containing protein 2 KDM1A KIAA0601 Lysine-specific demethylase 1 (LSD1) Lysine-specific histone demethylase 1 (LSD1)
Type:
Enzyme
Mol. Mass.:
92901.01
Organism:
Homo sapiens (Human)
Description:
O60341
Residue:
852
  
Inhibitor
Name:
BDBM389025
Synonyms:
4-[5-({(3R)-1-[(2S)-2- hydroxypropyl]piperidin-3- yl}methoxy)-8-(3-methyl-2-oxo-2,3- dihydro-1,3-benzoxazol-6- yl)imidazo[1,2-c]pyrimidin-7- yl]benzonitrile US11401272, Example 134 | US9944647, Example 134
Type:
Small organic molecule
Emp. Form.:
C30H30N6O4
Mol. Mass.:
538.597
SMILES:
C[C@H](O)CN1CCC[C@@H](COc2nc(-c3ccc(cc3)C#N)c(-c3ccc4n(C)c(=O)oc4c3)c3nccn23)C1
: