Target
[Pyruvate dehydrogenase (acetyl-transferring)] kinase isozyme 1, mitochondrial
Ligand
BDBM467057
Substrate
Meas. Tech.
Inhibitory Action of PDHK1 Activity In Vitro
IC50
<3.00±n/a nM
Citation
 Maeba, TSuzawa, KKotoku, MMasuo, RMotoda, DYamaoka, N Nitrogen-containing heterocyclic amide compound and pharmaceutical use thereof US Patent  US10800784 Publication Date 10/13/2020 
Target
Name:
[Pyruvate dehydrogenase (acetyl-transferring)] kinase isozyme 1, mitochondrial
Synonyms:
PDHK1 PDK1_HUMAN Pyruvate dehydrogenase kinase 1 (PDK1) | Pyruvate dehydrogenase kinase isoform 1
Type:
Protein
Mol. Mass.:
49255.23
Organism:
Homo sapiens (Human)
Description:
Q15118
Residue:
436
  
Inhibitor
Name:
BDBM467057
Synonyms:
US10800784, Example 47
Type:
Small organic molecule
Emp. Form.:
C21H20F5N5O2
Mol. Mass.:
469.4078
SMILES:
C[C@H]1CN(Cc2cnc(n12)[C@@](C)(O)C(F)(F)F)C(=O)c1cc(nn1C)-c1ccc(F)cc1F
: