Target
Tyrosine-protein kinase BTK
Ligand
BDBM467254
Substrate
Meas. Tech.
Cell Proliferation Assays
IC50
505±n/a nM
Citation
 Zhao, XZhang, WChen, ZChen, LWang, XLi, ZTan, RYang, LTan, HLiu, BRan, KZou, ZLin, MSun, JWang, W Substituted pyrrolo[2,3-d]pyridazin-4-ones and pyrazolo[3,4-d]pyridazin-4-ones as protein kinase inhibitors US Patent  US10800785 Publication Date 10/13/2020 
Target
Name:
Tyrosine-protein kinase BTK
Synonyms:
AGMX1 Agammaglobulinaemia tyrosine kinase B cell progenitor kinase BPK BTK_HUMAN Tyrosine Kinase BTK Tyrosine-protein kinase BTK (BTK)
Type:
Enzyme
Mol. Mass.:
76289.95
Organism:
Homo sapiens (Human)
Description:
Q06187
Residue:
659
  
Inhibitor
Name:
BDBM467254
Synonyms:
(R)-7-amino-3-(1-(but-2-ynoyl)pyrrolidin-3-yl)- 1-(4-phenoxyphenyl)-1,5-dihydro-4H- pyrazolo[3,4-d]pyridazin-4-one | US10800785, Example 65
Type:
Small organic molecule
Emp. Form.:
C25H22N6O3
Mol. Mass.:
454.4806
SMILES:
CC#CC(=O)N1CC[C@H](C1)c1nn(-c2ccc(Oc3ccccc3)cc2)c2c(N)n[nH]c(=O)c12
: