Target
Ataxin-1
Ligand
BDBM467335
Substrate
Meas. Tech.
Human Atx Enzyme Inhibition Assay
IC50
5.00±n/a nM
Citation
 Mattei, PHert, JHunziker, DRudolph, MSchmitz, PDi Giorgio, P Bicyclic compounds as ATX inhibitors US Patent  US10800786 Publication Date 10/13/2020 
Target
Name:
Ataxin-1
Synonyms:
ATX1 ATXN1 | SCA1
Type:
Protein
Mol. Mass.:
86941.25
Organism:
Homo sapiens (Human)
Description:
P54253
Residue:
815
  
Inhibitor
Name:
BDBM467335
Synonyms:
US10800786, Example 2.07
Type:
Small organic molecule
Emp. Form.:
C27H33N7O5
Mol. Mass.:
535.5948
SMILES:
O=C(N1CC2=C(C1)CN(C2)C(=O)c1cc(OCC2CCOCC2)nc(c1)C1CC1)N1CCn2c(C1)n[nH]c2=O
: