Target
Ataxin-1
Ligand
BDBM467339
Substrate
Meas. Tech.
Human Atx Enzyme Inhibition Assay
IC50
12.0±n/a nM
Citation
 Mattei, PHert, JHunziker, DRudolph, MSchmitz, PDi Giorgio, P Bicyclic compounds as ATX inhibitors US Patent  US10800786 Publication Date 10/13/2020 
Target
Name:
Ataxin-1
Synonyms:
ATX1 ATXN1 | SCA1
Type:
Protein
Mol. Mass.:
86941.25
Organism:
Homo sapiens (Human)
Description:
P54253
Residue:
815
  
Inhibitor
Name:
BDBM467339
Synonyms:
US10800786, Example 2.11
Type:
Small organic molecule
Emp. Form.:
C24H24F3N5O5
Mol. Mass.:
519.4731
SMILES:
Oc1noc2CN(CCc12)C(=O)N1CC2=C(C1)CN(C2)C(=O)c1cnc(OCC(F)(F)F)c(c1)C1CC1
: