Target
Tyrosine-protein kinase BTK
Ligand
BDBM467852
Substrate
Meas. Tech.
TBD
IC50
6.31±n/a nM
Citation
 Arora, NBacani, GMBarbay, JKBembenek, SDCai, MChen, WDeckhut, CPEdwards, JPGhosh, BHao, BKreutter, KDLi, GTichenor, MSVenable, JDWei, JWiener, JJWu, YZhu, YZhang, FZhang, ZXiao, K Inhibitors of Bruton's tyrosine kinase and method of their use US Patent  US10800792 Publication Date 10/13/2020 
Target
Name:
Tyrosine-protein kinase BTK
Synonyms:
AGMX1 Agammaglobulinaemia tyrosine kinase B cell progenitor kinase BPK BTK_HUMAN Tyrosine Kinase BTK Tyrosine-protein kinase BTK (BTK)
Type:
Enzyme
Mol. Mass.:
76289.95
Organism:
Homo sapiens (Human)
Description:
Q06187
Residue:
659
  
Inhibitor
Name:
BDBM467852
Synonyms:
(R)-N-(1-Acryloylpiperidin-3-yl)-4-oxo-5-(5-phenoxypyridin-2-yl)- 4,5-dihydro-3H-1-thia-3,5,8-triazaacenaphthylene-2-carboxamide; US10822348, Example 513
Type:
Small organic molecule
Emp. Form.:
C28H24N6O4S
Mol. Mass.:
540.593
SMILES:
C=CC(=O)N1CCC[C@H](C1)NC(=O)c1sc2nccc3n(-c4ccc(Oc5ccccc5)cn4)c(=O)[nH]c1c23
: