Target
Metabotropic glutamate receptor 2
Ligand
BDBM403474
Substrate
Meas. Tech.
Biological Assays
IC50
536±n/a nM
Citation
 Sebhat, IKArasappan, AHoyt, SBWilkening, RRDeMong, D Chromane, isochromane and dihydroisobenzofuran derivatives as mGluR2-negative allosteric modulators, compositions, and their use US Patent  US10806724 Publication Date 10/20/2020 
Target
Name:
Metabotropic glutamate receptor 2
Synonyms:
GPRC1B GRM2_HUMAN Metabotropic glutamate receptor mGlu2 | metabotropic glutamate 2
Type:
Enzyme
Mol. Mass.:
95584.88
Organism:
Homo sapiens (Human)
Description:
Q14416
Residue:
872
  
Inhibitor
Name:
BDBM403474
Synonyms:
(S)- or (R)-2- ((difluoro- methoxy)methyl)- 5-(2- methylthiazol-5- yl)-3,4-dihydro- 2H-pyrano[2,3- b]pyridine-7- carboxamide US10806724, Example 3-3A
Type:
Small organic molecule
Emp. Form.:
C15H15F2N3O3S
Mol. Mass.:
355.36
SMILES:
Cc1ncc(s1)-c1cc(nc2O[C@@H](COC(F)F)CCc12)C(N)=O
: