Target
Methionine aminopeptidase 2
Ligand
BDBM468980
Substrate
Meas. Tech.
Enzymatic Activity Assay of MetAP2
IC50
60.3±n/a nM
Citation
 Ho, KKQuan, WZhou, J Pyrrolidinone compounds US Patent  US10807971 Publication Date 10/20/2020 
Target
Name:
Methionine aminopeptidase 2
Synonyms:
MAP2_MOUSE Methionine aminopeptidase Type 2 (MetAP2) P67eif2 | Peptidase M 2
Type:
Enzyme
Mol. Mass.:
52914.64
Organism:
Mus musculus (Mouse)
Description:
O08663
Residue:
478
  
Inhibitor
Name:
BDBM468980
Synonyms:
1-[1-[(3R,5S,6R)-5-Amino- 6-(2,5- difluorophenyl)tetrahydropyran- 3-yl]pyrazol-3-yl]-N-[(3- fluorophenyl)methyl]-3- hydroxy-2-oxo-pyrrolidine-3- carboxamide, isomer 1 hydrochloride | US10807971, Example 16
Type:
Small organic molecule
Emp. Form.:
C26H26F3N5O4
Mol. Mass.:
529.5109
SMILES:
N[C@H]1C[C@H](CO[C@@H]1c1cc(F)ccc1F)n1ccc(n1)N1CCC(O)(C(=O)NCc2cccc(F)c2)C1=O
: