Target
Dipeptidyl peptidase 4
Ligand
BDBM468981
Substrate
Meas. Tech.
Enzymatic Activity Assay of DPP-4
IC50
14.7±n/a nM
Citation
 Ho, KKQuan, WZhou, J Pyrrolidinone compounds US Patent  US10807971 Publication Date 10/20/2020 
Target
Name:
Dipeptidyl peptidase 4
Synonyms:
ADABP Adenosine deaminase complexing protein 2 CD_antigen=CD26 DPP4 DPPIV Dipeptidyl peptidase 4 (DPP IV) Dipeptidyl peptidase 4 (DPP4) Dipeptidyl peptidase 4 membrane form Dipeptidyl peptidase IV Dipeptidyl peptidase IV (DDP-IV) Dipeptidyl peptidase IV membrane form Dipeptidyl peptidase-IV (DPP-4) T-cell activation antigen CD26 | TP103
Type:
Enzyme
Mol. Mass.:
88271.01
Organism:
Homo sapiens (Human)
Description:
P27487
Residue:
766
  
Inhibitor
Name:
BDBM468981
Synonyms:
(3S)-1-[2-[1-[(3R,5S,6R)-5-Amino-6-(2,5-difluorophenyl)tetrahydropyran-3-yl]-3,6-dihydro-2H-pyridin-4-yl]pyrimidin-5-yl]-N-[(3-chloro-5-fluoro-phenyl)methyl]-3-hydroxy-2-oxo-pyrrolidine-3-carboxamide, hydrochloride | US10807971, Example 17
Type:
Small organic molecule
Emp. Form.:
C32H32ClF3N6O4
Mol. Mass.:
657.082
SMILES:
N[C@H]1C[C@H](CO[C@@H]1c1cc(F)ccc1F)N1CCC(=CC1)c1ncc(cn1)N1CC[C@](O)(C(=O)NCc2cc(F)cc(Cl)c2)C1=O
: