Target
Lysyl oxidase homolog 2
Ligand
BDBM469078
Substrate
Meas. Tech.
LOXL2 Enzyme Activity Assay (c)
IC50
200±n/a nM
Citation
 Springer, CMarais, RNiculescu-Duvaz, DLeung, LSmithen, DCallens, CTang, H Methylamine derivatives as lysysl oxidase inhibitors for the treatment of cancer US Patent  US10807974 Publication Date 10/20/2020 
Target
Name:
Lysyl oxidase homolog 2
Synonyms:
1.4.3.13 LOXL2_HUMAN Lysyl oxidase-like protein 2 Lysyl oxidase-related protein WS9-14
Type:
PROTEIN
Mol. Mass.:
86721.38
Organism:
Homo sapiens (Human)
Description:
ChEMBL_115990
Residue:
774
  
Inhibitor
Name:
BDBM469078
Synonyms:
US10807974, Example 97 US11608330, Example 97
Type:
Small organic molecule
Emp. Form.:
C18H14N2O2S2
Mol. Mass.:
354.446
SMILES:
NCc1ncc(s1)S(=O)(=O)c1cc2ccccc2c2ccccc12
: