Target
Lysyl oxidase homolog 2
Ligand
BDBM469099
Substrate
Meas. Tech.
LOXL2 Enzyme Activity Assay (c)
IC50
110±n/a nM
Citation
 Springer, CMarais, RNiculescu-Duvaz, DLeung, LSmithen, DCallens, CTang, H Methylamine derivatives as lysysl oxidase inhibitors for the treatment of cancer US Patent  US10807974 Publication Date 10/20/2020 
Target
Name:
Lysyl oxidase homolog 2
Synonyms:
1.4.3.13 LOXL2_HUMAN Lysyl oxidase-like protein 2 Lysyl oxidase-related protein WS9-14
Type:
PROTEIN
Mol. Mass.:
86721.38
Organism:
Homo sapiens (Human)
Description:
ChEMBL_115990
Residue:
774
  
Inhibitor
Name:
BDBM469099
Synonyms:
US10807974, Example 118 US11608330, Example 118
Type:
Small organic molecule
Emp. Form.:
C14H12N4O2S2
Mol. Mass.:
332.401
SMILES:
NCc1ncc(s1)S(=O)(=O)c1cnc(nc1)-c1ccccc1
: