Target
Bromodomain-containing protein 4
Ligand
BDBM469199
Substrate
Meas. Tech.
In Vitro Enzyme Inhibition Assay
IC50
<500±n/a nM
Citation
 Bennett, MJBetancort, JMBoloor, AKaldor, SWStafford, JAVeal, JM Bromodomain inhibitors US Patent  US10807982 Publication Date 10/20/2020 
Target
Name:
Bromodomain-containing protein 4
Synonyms:
BRD4 Bromodomain-containing protein 4 (BRD4) Protein HUNK1
Type:
Protein
Mol. Mass.:
152264.84
Organism:
Homo sapiens (Human)
Description:
O60885
Residue:
1362
  
Inhibitor
Name:
BDBM469199
Synonyms:
N-[2-cyclopropyl-7-(1,5-dimethyl-6-oxopyridin- 3-yl)-1-benzofuran-5-yl]methanesulfonamide | US10807982, Example 80
Type:
Small organic molecule
Emp. Form.:
C19H20N2O4S
Mol. Mass.:
372.438
SMILES:
Cc1cc(cn(C)c1=O)-c1cc(NS(C)(=O)=O)cc2cc(oc12)C1CC1
: