Target
Mast/stem cell growth factor receptor Kit [D816V]
Ligand
BDBM469237
Substrate
Meas. Tech.
KIT D816V assay at Km
IC50
<1.0±n/a nM
Citation
 Wilson, KJ Compositions useful for treating disorders related to kit US Patent  US10807985 Publication Date 10/20/2020 
Target
Name:
Mast/stem cell growth factor receptor Kit [D816V]
Synonyms:
KIT Mast/stem cell growth factor receptor Kit (D816V) SCFR | Tyrosine-protein kinase Kit (Kit)(D816V)
Type:
Protein
Mol. Mass.:
109854.42
Organism:
Homo sapiens (Human)
Description:
Human Kit D816V mutant
Residue:
976
  
Inhibitor
Name:
BDBM469237
Synonyms:
US10807985, Compound 12
Type:
Small organic molecule
Emp. Form.:
C25H26N10
Mol. Mass.:
466.5409
SMILES:
C[C@](N)(c1ccccc1)c1cnc(nc1)N1CCN(CC1)c1ncnn2cc(cc12)-c1cn[nH]c1
: