Target
Platelet-derived growth factor receptor alpha [D842V]
Ligand
BDBM469341
Substrate
Meas. Tech.
PDGFRA D842V assay at Km
IC50
<1.0±n/a nM
Citation
 Wilson, KJ Compositions useful for treating disorders related to kit US Patent  US10807985 Publication Date 10/20/2020 
Target
Name:
Platelet-derived growth factor receptor alpha [D842V]
Synonyms:
PDGFR2 PGFRA_HUMAN Platelet-derived growth factor receptor alpha (PDGFR)(D842V) RHEPDGFRA
Type:
Protein
Mol. Mass.:
122618.43
Organism:
Homo sapiens (Human)
Description:
P16234 (D842V)
Residue:
1089
  
Inhibitor
Name:
BDBM469341
Synonyms:
US10807985, Compound 116
Type:
Small organic molecule
Emp. Form.:
C26H24F3N9O
Mol. Mass.:
535.5237
SMILES:
Cn1cc(cn1)-c1cc2c(ncnn2c1)N1CCN(CC1)c1ncc(cn1)[C@@](C)(O)c1c(F)cc(F)cc1F
: