Target
Sphingosine 1-phosphate receptor 5
Ligand
BDBM321298
Substrate
Meas. Tech.
In Vitro Functional Activity (Agonism) on Human S1P5 Receptors
EC50
200±n/a nM
Citation
 Stoit, AIwema Bakker, WICoolen, HKvan Dongen, MJLeflemme, NJHobson, A Spiro-cyclic amine derivatives as S1P modulators US Patent  US10807991 Publication Date 10/20/2020 
Target
Name:
Sphingosine 1-phosphate receptor 5
Synonyms:
EDG8 S1P5 S1PR5_HUMAN Sphingosine 1-phosphate receptor Edg-8
Type:
G Protein-Coupled Receptor (GPCR)
Mol. Mass.:
41796.42
Organism:
Homo sapiens (Human)
Description:
Residue:
398
  
Inhibitor
Name:
BDBM321298
Synonyms:
US10179791, Compound 38 | US10807991, Compound 38
Type:
Small organic molecule
Emp. Form.:
C22H23ClFNO4
Mol. Mass.:
419.874
SMILES:
OC(=O)CCN1CCC2(COc3cc(OCc4c(F)cccc4Cl)ccc23)CC1
: