Target
Sphingosine 1-phosphate receptor 1
Ligand
BDBM321300
Substrate
Meas. Tech.
In Vitro Functional Activity (Agonism) on Human S1P1 Receptors (Method B)
EC50
>3162±n/a nM
Citation
 Stoit, AIwema Bakker, WICoolen, HKvan Dongen, MJLeflemme, NJHobson, A Spiro-cyclic amine derivatives as S1P modulators US Patent  US10807991 Publication Date 10/20/2020 
Target
Name:
Sphingosine 1-phosphate receptor 1
Synonyms:
CHEDG1 Endothelial differentiation G-protein coupled receptor 1 S1P1 S1PR1_HUMAN Sphingosine 1-phosphate receptor Edg-1
Type:
Enzyme
Mol. Mass.:
42836.02
Organism:
Homo sapiens (Human)
Description:
P21453
Residue:
382
  
Inhibitor
Name:
BDBM321300
Synonyms:
US10179791, Compound 59 | US10807991, Compound 59
Type:
Small organic molecule
Emp. Form.:
C23H25Cl2NO4
Mol. Mass.:
450.355
SMILES:
Cc1cc(Cl)c(COc2ccc3c(OCC33CCN(CCC(O)=O)CC3)c2)c(Cl)c1
: