Target
Sphingosine 1-phosphate receptor 5
Ligand
BDBM321329
Substrate
Meas. Tech.
In Vitro Functional Activity (Agonism) on Human S1P5 Receptors
EC50
15.8±n/a nM
Citation
 Stoit, AIwema Bakker, WICoolen, HKvan Dongen, MJLeflemme, NJHobson, A Spiro-cyclic amine derivatives as S1P modulators US Patent  US10807991 Publication Date 10/20/2020 
Target
Name:
Sphingosine 1-phosphate receptor 5
Synonyms:
EDG8 S1P5 S1PR5_HUMAN Sphingosine 1-phosphate receptor Edg-8
Type:
G Protein-Coupled Receptor (GPCR)
Mol. Mass.:
41796.42
Organism:
Homo sapiens (Human)
Description:
Residue:
398
  
Inhibitor
Name:
BDBM321329
Synonyms:
US10179791, Compound 258 | US10807991, Compound 258
Type:
Small organic molecule
Emp. Form.:
C26H33NO4
Mol. Mass.:
423.5445
SMILES:
CCc1cccc(CC)c1COc1ccc2c(OCC22CCN(CCC(O)=O)CC2)c1
: