Target
Wee1-like protein kinase
Ligand
BDBM470159
Substrate
Meas. Tech.
WEE1 IC50 Determination
IC50
35.0±n/a nM
Citation
 Chakravarty, SPham, SMKankanala, JAgarwal, AKPujala, BSoni, SArya, SKPalve, DKumar, V Heterocyclic compounds and uses thereof US Patent  US10807994 Publication Date 10/20/2020 
Target
Name:
Wee1-like protein kinase
Synonyms:
Serine/threonine-protein kinase WEE1 WEE1 homolog (S. pombe) | WEE1_HUMAN
Type:
PROTEIN
Mol. Mass.:
71599.12
Organism:
Homo sapiens (Human)
Description:
ChEMBL_1445054
Residue:
646
  
Inhibitor
Name:
BDBM470159
Synonyms:
US10807994, Compound 1.35 | US10807994, Example S-35
Type:
Small organic molecule
Emp. Form.:
C22H19Cl2N5O2
Mol. Mass.:
456.325
SMILES:
CN1CCc2ccc(Nc3ncc4C(=O)N(COc4n3)c3c(Cl)cccc3Cl)cc2C1
: