Target
Wee1-like protein kinase
Ligand
BDBM470193
Substrate
Meas. Tech.
WEE1 IC50 Determination
IC50
66.0±n/a nM
Citation
 Chakravarty, SPham, SMKankanala, JAgarwal, AKPujala, BSoni, SArya, SKPalve, DKumar, V Heterocyclic compounds and uses thereof US Patent  US10807994 Publication Date 10/20/2020 
Target
Name:
Wee1-like protein kinase
Synonyms:
Serine/threonine-protein kinase WEE1 WEE1 homolog (S. pombe) | WEE1_HUMAN
Type:
PROTEIN
Mol. Mass.:
71599.12
Organism:
Homo sapiens (Human)
Description:
ChEMBL_1445054
Residue:
646
  
Inhibitor
Name:
BDBM470193
Synonyms:
US10807994, Compound 1.175 | US10807994, Example S-69
Type:
Small organic molecule
Emp. Form.:
C20H13Cl2N5O2
Mol. Mass.:
426.256
SMILES:
Clc1cccc(Cl)c1N1COc2nc(Nc3ccc4[nH]ccc4c3)ncc2C1=O
: