Target
Fibroblast growth factor receptor 3
Ligand
BDBM356564
Substrate
Meas. Tech.
Enzymatic Assay
IC50
<10±n/a nM
Citation
 Yao, WZhang, CXu, MZhuo, JHe, C Substituted imidazopyridazines and benzimidazoles as inhibitors of FGFR3 US Patent  US10813930 Publication Date 10/27/2020 
Target
Name:
Fibroblast growth factor receptor 3
Synonyms:
CD_antigen: CD333 FGFR3 Fibroblast growth factor receptor JTK4
Type:
Protein
Mol. Mass.:
87699.57
Organism:
Homo sapiens (Human)
Description:
P22607
Residue:
806
  
Inhibitor
Name:
BDBM356564
Synonyms:
N-[3-(7-{6-[4-(pyrrolidin-1-ylcarbonyl)piperazin-1-yl]pyridin-3-yl}imidazo[1,2-b]pyridazin-3-yl)phenyl]-N′-(2,2,2-trifluoroethyl)urea US10813930, Ex. No. 53
Type:
Small organic molecule
Emp. Form.:
C29H30F3N9O2
Mol. Mass.:
593.6028
SMILES:
FC(F)(F)CNC(=O)Nc1cccc(c1)-c1cnc2cc(cnn12)-c1ccc(nc1)N1CCN(CC1)C(=O)N1CCCC1
: