Target
Fibroblast growth factor receptor 3
Ligand
BDBM356587
Substrate
Meas. Tech.
Enzymatic Assay
IC50
<10±n/a nM
Citation
 Yao, WZhang, CXu, MZhuo, JHe, C Substituted imidazopyridazines and benzimidazoles as inhibitors of FGFR3 US Patent  US10813930 Publication Date 10/27/2020 
Target
Name:
Fibroblast growth factor receptor 3
Synonyms:
CD_antigen: CD333 FGFR3 Fibroblast growth factor receptor JTK4
Type:
Protein
Mol. Mass.:
87699.57
Organism:
Homo sapiens (Human)
Description:
P22607
Residue:
806
  
Inhibitor
Name:
BDBM356587
Synonyms:
N-{3-[7-(1-{3-(Cyanomethyl)-1-[(dimethylamino)acetyl]azetidin-3-yl}-1H-pyrazol-4-yl)imidazo[1,2-b]pyridazin-3-yl]phenyl}-N′-(2,2,2-trifluoroethyl)urea US10813930, Ex. No. 76
Type:
Small organic molecule
Emp. Form.:
C27H27F3N10O2
Mol. Mass.:
580.5643
SMILES:
CN(C)CC(=O)N1CC(CC#N)(C1)n1cc(cn1)-c1cnn2c(cnc2c1)-c1cccc(NC(=O)NCC(F)(F)F)c1
: