Target
Receptor-interacting serine/threonine-protein kinase 1
Ligand
BDBM470238
Substrate
Meas. Tech.
Biochemical Assay
IC50
136±n/a nM
Citation
 Masuda, EShaw, STaylor, VBhamidipati, S RIP1 inhibitory compounds and methods for making and using the same US Patent  US10815206 Publication Date 10/27/2020 
Target
Name:
Receptor-interacting serine/threonine-protein kinase 1
Synonyms:
Cell death protein RIP RIP-1 RIPK1 Receptor-interacting protein 1
Type:
Enzyme Catalytic Domain
Mol. Mass.:
75926.99
Organism:
Homo sapiens (Human)
Description:
Q13546
Residue:
671
  
Inhibitor
Name:
BDBM470238
Synonyms:
US10815206, Compound I-15
Type:
Small organic molecule
Emp. Form.:
C24H26N5O4
Mol. Mass.:
448.4943
SMILES:
CN1c2cc(CCCCO)ccc2OC[C@H](NC(=O)c2nnc(Cc3ccccc3)n2)C1=O
: