Target
Tyrosine-protein kinase BTK
Ligand
BDBM377718
Substrate
Meas. Tech.
LanthaScreen Assay
IC50
54.2±n/a nM
Citation
 Springer, JRDevadas, BGarland, DJGrapperhaus, MLHan, SHockerman, SLHughes, ROSaiah, ESchnute, MESelness, SRWalker, DPWan, ZXing, LZapf, CWSchmidt, MA Bruton's tyrosine kinase inhibitors US Patent  US10815213 Publication Date 10/27/2020 
Target
Name:
Tyrosine-protein kinase BTK
Synonyms:
AGMX1 Agammaglobulinaemia tyrosine kinase B cell progenitor kinase BPK BTK_HUMAN Tyrosine Kinase BTK Tyrosine-protein kinase BTK (BTK)
Type:
Enzyme
Mol. Mass.:
76289.95
Organism:
Homo sapiens (Human)
Description:
Q06187
Residue:
659
  
Inhibitor
Name:
BDBM377718
Synonyms:
5-amino-1-[2-(cyanomethyl)-2-azabicyclo[2.2.1]hept-5-yl]-3-(4-phenoxyphenyl)-1H-pyrazole-4-carboxamide US10815213, Example 12
Type:
Small organic molecule
Emp. Form.:
C24H24N6O2
Mol. Mass.:
428.4864
SMILES:
NC(=O)c1c(N)n(nc1-c1ccc(Oc2ccccc2)cc1)C1CC2CC1CN2CC#N
: