Target
Tyrosine-protein kinase BTK
Ligand
BDBM470355
Substrate
Meas. Tech.
LanthaScreen Assay
IC50
0.400±n/a nM
Citation
 Springer, JRDevadas, BGarland, DJGrapperhaus, MLHan, SHockerman, SLHughes, ROSaiah, ESchnute, MESelness, SRWalker, DPWan, ZXing, LZapf, CWSchmidt, MA Bruton's tyrosine kinase inhibitors US Patent  US10815213 Publication Date 10/27/2020 
Target
Name:
Tyrosine-protein kinase BTK
Synonyms:
AGMX1 Agammaglobulinaemia tyrosine kinase B cell progenitor kinase BPK BTK_HUMAN Tyrosine Kinase BTK Tyrosine-protein kinase BTK (BTK)
Type:
Enzyme
Mol. Mass.:
76289.95
Organism:
Homo sapiens (Human)
Description:
Q06187
Residue:
659
  
Inhibitor
Name:
BDBM470355
Synonyms:
(R)-5-amino-1-(1-cyanopiperidin-3-yl)-3-[4-(3,4-dimethylphenoxy)phenyl]-1H-pyrazole-4-carboxamide | US10815213, Example 17
Type:
Small organic molecule
Emp. Form.:
C24H26N6O2
Mol. Mass.:
430.5022
SMILES:
Cc1ccc(Oc2ccc(cc2)-c2nn([C@@H]3CCCN(C3)C#N)c(N)c2C(N)=O)cc1C
: