Target
Tyrosine-protein kinase BTK
Ligand
BDBM377774
Substrate
Meas. Tech.
LanthaScreen Assay
IC50
1.90±n/a nM
Citation
 Springer, JRDevadas, BGarland, DJGrapperhaus, MLHan, SHockerman, SLHughes, ROSaiah, ESchnute, MESelness, SRWalker, DPWan, ZXing, LZapf, CWSchmidt, MA Bruton's tyrosine kinase inhibitors US Patent  US10815213 Publication Date 10/27/2020 
Target
Name:
Tyrosine-protein kinase BTK
Synonyms:
AGMX1 Agammaglobulinaemia tyrosine kinase B cell progenitor kinase BPK BTK_HUMAN Tyrosine Kinase BTK Tyrosine-protein kinase BTK (BTK)
Type:
Enzyme
Mol. Mass.:
76289.95
Organism:
Homo sapiens (Human)
Description:
Q06187
Residue:
659
  
Inhibitor
Name:
BDBM377774
Synonyms:
5-amino-1-(1-cyanopiperidin-3-yl)-3-[4-(3-methylbenzyl)phenyl]-1H-pyrazole-4-carboxamide US10815213, Example 68
Type:
Small organic molecule
Emp. Form.:
C24H26N6O
Mol. Mass.:
414.5028
SMILES:
Cc1cccc(Cc2ccc(cc2)-c2nn(C3CCCN(C3)C#N)c(N)c2C(N)=O)c1
: