Target
Tyrosine-protein kinase BTK
Ligand
BDBM377792
Substrate
Meas. Tech.
LanthaScreen Assay
IC50
26.8±n/a nM
Citation
 Springer, JRDevadas, BGarland, DJGrapperhaus, MLHan, SHockerman, SLHughes, ROSaiah, ESchnute, MESelness, SRWalker, DPWan, ZXing, LZapf, CWSchmidt, MA Bruton's tyrosine kinase inhibitors US Patent  US10815213 Publication Date 10/27/2020 
Target
Name:
Tyrosine-protein kinase BTK
Synonyms:
AGMX1 Agammaglobulinaemia tyrosine kinase B cell progenitor kinase BPK BTK_HUMAN Tyrosine Kinase BTK Tyrosine-protein kinase BTK (BTK)
Type:
Enzyme
Mol. Mass.:
76289.95
Organism:
Homo sapiens (Human)
Description:
Q06187
Residue:
659
  
Inhibitor
Name:
BDBM377792
Synonyms:
5-amino-3-[4-(4-chlorobenzyl)phenyl]-(1-cyanopiperidin-3-yl)-1H-pyrazole-4-carboxamide US10815213, Example 86
Type:
Small organic molecule
Emp. Form.:
C23H23ClN6O
Mol. Mass.:
434.921
SMILES:
NC(=O)c1c(N)n(nc1-c1ccc(Cc2ccc(Cl)cc2)cc1)C1CCCN(C1)C#N
: