Target
Tyrosine-protein kinase BTK
Ligand
BDBM470455
Substrate
Meas. Tech.
LanthaScreen Assay
IC50
18.9±n/a nM
Citation
 Springer, JRDevadas, BGarland, DJGrapperhaus, MLHan, SHockerman, SLHughes, ROSaiah, ESchnute, MESelness, SRWalker, DPWan, ZXing, LZapf, CWSchmidt, MA Bruton's tyrosine kinase inhibitors US Patent  US10815213 Publication Date 10/27/2020 
Target
Name:
Tyrosine-protein kinase BTK
Synonyms:
AGMX1 Agammaglobulinaemia tyrosine kinase B cell progenitor kinase BPK BTK_HUMAN Tyrosine Kinase BTK Tyrosine-protein kinase BTK (BTK)
Type:
Enzyme
Mol. Mass.:
76289.95
Organism:
Homo sapiens (Human)
Description:
Q06187
Residue:
659
  
Inhibitor
Name:
BDBM470455
Synonyms:
(S)-5-amino-1-(1-cyanopiperidin-3-yl)-3-(4-((6-(trifluoromethyl)pyridin-2-yl)oxy)phenyl)-1H-pyrazole-4-carboxamide | US10815213, Example 117
Type:
Small organic molecule
Emp. Form.:
C22H20F3N7O2
Mol. Mass.:
471.4351
SMILES:
NC(=O)c1c(N)n(nc1-c1ccc(Oc2cccc(n2)C(F)(F)F)cc1)[C@H]1CCCN(C1)C#N
: