Target
Tyrosine-protein kinase BTK
Ligand
BDBM377834
Substrate
Meas. Tech.
LanthaScreen Assay
IC50
4.50±n/a nM
Citation
 Springer, JRDevadas, BGarland, DJGrapperhaus, MLHan, SHockerman, SLHughes, ROSaiah, ESchnute, MESelness, SRWalker, DPWan, ZXing, LZapf, CWSchmidt, MA Bruton's tyrosine kinase inhibitors US Patent  US10815213 Publication Date 10/27/2020 
Target
Name:
Tyrosine-protein kinase BTK
Synonyms:
AGMX1 Agammaglobulinaemia tyrosine kinase B cell progenitor kinase BPK BTK_HUMAN Tyrosine Kinase BTK Tyrosine-protein kinase BTK (BTK)
Type:
Enzyme
Mol. Mass.:
76289.95
Organism:
Homo sapiens (Human)
Description:
Q06187
Residue:
659
  
Inhibitor
Name:
BDBM377834
Synonyms:
5-amino-1-{1-[(2E)-but-2-enoyl]piperidin-3-yl}-3-(4-phenoxyphenyl)-1H-pyrazole-4-carboxamide US10815213, Example 128
Type:
Small organic molecule
Emp. Form.:
C25H27N5O3
Mol. Mass.:
445.5136
SMILES:
C\C=C\C(=O)N1CCCC(C1)n1nc(c(C(N)=O)c1N)-c1ccc(Oc2ccccc2)cc1
: