Target
Tyrosine-protein kinase BTK
Ligand
BDBM470486
Substrate
Meas. Tech.
LanthaScreen Assay
IC50
39.0±n/a nM
Citation
 Springer, JRDevadas, BGarland, DJGrapperhaus, MLHan, SHockerman, SLHughes, ROSaiah, ESchnute, MESelness, SRWalker, DPWan, ZXing, LZapf, CWSchmidt, MA Bruton's tyrosine kinase inhibitors US Patent  US10815213 Publication Date 10/27/2020 
Target
Name:
Tyrosine-protein kinase BTK
Synonyms:
AGMX1 Agammaglobulinaemia tyrosine kinase B cell progenitor kinase BPK BTK_HUMAN Tyrosine Kinase BTK Tyrosine-protein kinase BTK (BTK)
Type:
Enzyme
Mol. Mass.:
76289.95
Organism:
Homo sapiens (Human)
Description:
Q06187
Residue:
659
  
Inhibitor
Name:
BDBM470486
Synonyms:
5-amino-3-[4-(2,4-difluorophenoxy)phenyl]-1-{(3R)-1-[(2E,4S)-4-hydroxypent-2-enoyl]piperidin-3-yl}-1H-pyrazole-4-carboxamide | US10815213, Example 148
Type:
Small organic molecule
Emp. Form.:
C26H27F2N5O4
Mol. Mass.:
511.5205
SMILES:
C[C@H](O)\C=C\C(=O)N1CCC[C@H](C1)n1nc(c(C(N)=O)c1N)-c1ccc(Oc2ccc(F)cc2F)cc1
: