Target
Tyrosine-protein kinase BTK
Ligand
BDBM377867
Substrate
Meas. Tech.
LanthaScreen Assay
IC50
1.20±n/a nM
Citation
 Springer, JRDevadas, BGarland, DJGrapperhaus, MLHan, SHockerman, SLHughes, ROSaiah, ESchnute, MESelness, SRWalker, DPWan, ZXing, LZapf, CWSchmidt, MA Bruton's tyrosine kinase inhibitors US Patent  US10815213 Publication Date 10/27/2020 
Target
Name:
Tyrosine-protein kinase BTK
Synonyms:
AGMX1 Agammaglobulinaemia tyrosine kinase B cell progenitor kinase BPK BTK_HUMAN Tyrosine Kinase BTK Tyrosine-protein kinase BTK (BTK)
Type:
Enzyme
Mol. Mass.:
76289.95
Organism:
Homo sapiens (Human)
Description:
Q06187
Residue:
659
  
Inhibitor
Name:
BDBM377867
Synonyms:
1-[(3R)-1-acryloyl piperidin-3-yl]-5-amino-3-(4-{[6-(trifluoromethyl)pyridin-2-yl]oxy}phenyl)-1H-pyrazole-4-carboxamide US10815213, Example 161
Type:
Small organic molecule
Emp. Form.:
C24H23F3N6O3
Mol. Mass.:
500.473
SMILES:
NC(=O)c1c(N)n(nc1-c1ccc(Oc2cccc(n2)C(F)(F)F)cc1)C1CCCN(C1)C(=O)C=C
: