Target
Dihydroorotate dehydrogenase (quinone), mitochondrial
Ligand
BDBM470473
Substrate
Meas. Tech.
Enzymatic Assay
IC50
5.00±n/a nM
Citation
 Gradl, SNNguyen, DEis, KGünther, JStellfeld, TJanzer, AChristian, SMüller, TSheikh, SEZhou, HJZhao, CSykes, DBFerrara, SJLiu, KKröber, MMerz, CNiehues, MSchäfer, MZimmermann, KNising, CF 2,4,5-trisubstituted 1,2,4-triazolones useful as inhibitors of DHODH US Patent  US10815215 Publication Date 10/27/2020 
Target
Name:
Dihydroorotate dehydrogenase (quinone), mitochondrial
Synonyms:
DHODH Dihydroorotate dehydrogenase Dihydroorotate dehydrogenase, mitochondrial Dihydroorotate oxidase (DHODH) | PYRD_HUMAN
Type:
Enzyme
Mol. Mass.:
42881.33
Organism:
Homo sapiens (Human)
Description:
Q02127
Residue:
395
  
Inhibitor
Name:
BDBM470473
Synonyms:
N-(2-chloro-6-fluorophenyl)-5-fluoro-4-{3-[(1S)-1-hydroxyethyl]-4-methyl-5-oxo-4,5-dihydro-1H-1,2,4-triazol-1-yl}-2-[(2S)-pentan-2-yloxy]benzamide US11130745, Example 136 | US11713304, Example 136
Type:
Small organic molecule
Emp. Form.:
C23H25ClF2N4O4
Mol. Mass.:
494.919
SMILES:
CCC[C@H](C)Oc1cc(c(F)cc1C(=O)Nc1c(F)cccc1Cl)-n1nc([C@H](C)O)n(C)c1=O
: