Target
Dihydroorotate dehydrogenase (quinone), mitochondrial
Ligand
BDBM470522
Substrate
Meas. Tech.
Enzymatic Assay
IC50
2.80±n/a nM
Citation
 Gradl, SNNguyen, DEis, KGünther, JStellfeld, TJanzer, AChristian, SMüller, TSheikh, SEZhou, HJZhao, CSykes, DBFerrara, SJLiu, KKröber, MMerz, CNiehues, MSchäfer, MZimmermann, KNising, CF 2,4,5-trisubstituted 1,2,4-triazolones useful as inhibitors of DHODH US Patent  US10815215 Publication Date 10/27/2020 
Target
Name:
Dihydroorotate dehydrogenase (quinone), mitochondrial
Synonyms:
DHODH Dihydroorotate dehydrogenase Dihydroorotate dehydrogenase, mitochondrial Dihydroorotate oxidase (DHODH) | PYRD_HUMAN
Type:
Enzyme
Mol. Mass.:
42881.33
Organism:
Homo sapiens (Human)
Description:
Q02127
Residue:
395
  
Inhibitor
Name:
BDBM470522
Synonyms:
N-(2-chloro-6-fluorophenyl)-5-fluoro-4-[3-(hydroxymethyl)-5-oxo-4-propyl-4,5-dihydro-1H-1,2,4-triazol-1-yl]-2-{[(2S)-1,1,1-trifluoropropan-2-yl]oxy}benzamide US11130745, Example 182 | US11713304, Example 182
Type:
Small organic molecule
Emp. Form.:
C22H20ClF5N4O4
Mol. Mass.:
534.864
SMILES:
CCCn1c(CO)nn(-c2cc(O[C@@H](C)C(F)(F)F)c(cc2F)C(=O)Nc2c(F)cccc2Cl)c1=O
: