Target
Dihydroorotate dehydrogenase (quinone), mitochondrial
Ligand
BDBM470553
Substrate
Meas. Tech.
Enzymatic Assay
IC50
9.00±n/a nM
Citation
 Gradl, SNNguyen, DEis, KGünther, JStellfeld, TJanzer, AChristian, SMüller, TSheikh, SEZhou, HJZhao, CSykes, DBFerrara, SJLiu, KKröber, MMerz, CNiehues, MSchäfer, MZimmermann, KNising, CF 2,4,5-trisubstituted 1,2,4-triazolones useful as inhibitors of DHODH US Patent  US10815215 Publication Date 10/27/2020 
Target
Name:
Dihydroorotate dehydrogenase (quinone), mitochondrial
Synonyms:
DHODH Dihydroorotate dehydrogenase Dihydroorotate dehydrogenase, mitochondrial Dihydroorotate oxidase (DHODH) | PYRD_HUMAN
Type:
Enzyme
Mol. Mass.:
42881.33
Organism:
Homo sapiens (Human)
Description:
Q02127
Residue:
395
  
Inhibitor
Name:
BDBM470553
Synonyms:
1-(4-[(2,6-difluorophenyl)carbamoyl]-3-{[(2S)-1,1,1-trifluoropropan-2-yl]oxy}phenyl)-4-ethyl-5-oxo-4,5-dihydro-1H-1,2,4-triazole-3-carboxylic acid US11130745, Example 213 | US11713304, Example 213
Type:
Small organic molecule
Emp. Form.:
C21H17F5N4O5
Mol. Mass.:
500.3755
SMILES:
CCn1c(nn(-c2ccc(C(=O)Nc3c(F)cccc3F)c(O[C@@H](C)C(F)(F)F)c2)c1=O)C(O)=O
: