Target
Sodium channel protein type 8 subunit alpha
Ligand
BDBM373788
Substrate
Meas. Tech.
Electrophysiological Assay
IC50
32.0±n/a nM
Citation
 Burford, KNChowdhury, SDehnhardt, CMFocken, TGrimwood, MEHasan, SA Benzenesulfonamide compounds and their use as therapeutic agents US Patent  US10815229 Publication Date 10/27/2020 
Target
Name:
Sodium channel protein type 8 subunit alpha
Synonyms:
MED SCN8A_HUMAN Sodium channel protein type 8 subunit alpha Voltage-gated sodium channel subunit alpha Nav1.6 | ep nav1.6
Type:
PROTEIN
Mol. Mass.:
225271.59
Organism:
Homo sapiens (Human)
Description:
ChEMBL_1516902
Residue:
1980
  
Inhibitor
Name:
BDBM373788
Synonyms:
(R)-3-chloro-4-((1-(1-phenylethyl)piperidin-4-yl)oxy)-N-(thiazol-2-yl)benzenesulfonamide 2,2,2-trifluoroacetate US10662184, Example 55 US11299490, Example 55
Type:
Small organic molecule
Emp. Form.:
C22H24ClN3O3S2
Mol. Mass.:
478.027
SMILES:
C[C@@H](N1CCC(CC1)Oc1ccc(cc1Cl)S(=O)(=O)Nc1nccs1)c1ccccc1
: