Target
Induced myeloid leukemia cell differentiation protein Mcl-1 [171-327]
Ligand
BDBM471515
Substrate
Meas. Tech.
Time-Resolved Fluorescence Resonance Energy Transfer (TR-FRET) Assay
IC50
0.053±n/a nM
Citation
 Harrington, PEAshton, KBrown, SPKaller, MRKohn, TJLanman, BALi, KLi, YLow, JDMinatti, AEPickrell, AJStec, MMTaygerly, J Compounds that inhibit Mcl-1 protein US Patent  US10821115 Publication Date 11/3/2020 
Target
Name:
Induced myeloid leukemia cell differentiation protein Mcl-1 [171-327]
Synonyms:
BCL2L3 MCL1 Myeloid cell leukemia 1 (Mcl-1)
Type:
Enzyme Catalytic Domain
Mol. Mass.:
17896.13
Organism:
Homo sapiens (Human)
Description:
Q07820[171-327]
Residue:
157
  
Inhibitor
Name:
BDBM471515
Synonyms:
US10821115, Example 100532 | US11224601, Example 100532
Type:
Small organic molecule
Emp. Form.:
C39H46ClN3O5S
Mol. Mass.:
704.318
SMILES:
C[C@H]1C\C=C\[C@](O)(Cc2cc(C)ccn2)[C@@H]2CC[C@H]2CN2C[C@@]3(CCCc4cc(Cl)ccc34)COc3ccc(cc23)C(=O)NS(=O)(=O)[C@@H]1C
: