Target
Epidermal growth factor receptor
Ligand
BDBM471594
Substrate
Meas. Tech.
Inhibition Assay
IC50
3292±1346.12 nM
Citation
 Li, ZZhong, WWang, JZeng, QTsui, HYang, ZZhang, X ErbB receptor inhibitors US Patent  US10822334 Publication Date 11/3/2020 
Target
Name:
Epidermal growth factor receptor
Synonyms:
EGF Receptor Substrate EGFR_HUMAN ERBB1 Epidermal Growth Factor Receptor erbB-1 Epidermal growth factor receptor (EGFR) HER1 Proto-oncogene c-ErbB-1 Tyrosine-Protein Kinase ErbB-1
Type:
Receptor Kinase Domain
Mol. Mass.:
134279.59
Organism:
Homo sapiens (Human)
Description:
P00533
Residue:
1210
  
Inhibitor
Name:
BDBM471594
Synonyms:
US10822334, Compound 6
Type:
Small organic molecule
Emp. Form.:
C28H27F2N7O3
Mol. Mass.:
547.5559
SMILES:
COc1cc(O[C@H]2CCN(C)CC2(F)F)c2c(Nc3ccc(Oc4ccn5ncnc5c4)c(C)c3)ncnc2c1
: