Target
Receptor tyrosine-protein kinase erbB-2
Ligand
BDBM471595
Substrate
Meas. Tech.
Inhibition Assay
IC50
5.57±n/a nM
Citation
 Li, ZZhong, WWang, JZeng, QTsui, HYang, ZZhang, X ErbB receptor inhibitors US Patent  US10822334 Publication Date 11/3/2020 
Target
Name:
Receptor tyrosine-protein kinase erbB-2
Synonyms:
2.7.10.1 CD_antigen=CD340 ERBB2_HUMAN FASN/HER2 HER2 MLN19 NEU Proto-oncogene Neu Tyrosine kinase-type cell surface receptor HER2 | p185erbB2
Type:
Mol. Mass.:
137894.47
Organism:
Homo sapiens (Human)
Description:
P04626
Residue:
1255
  
Inhibitor
Name:
BDBM471595
Synonyms:
US10822334, Compound 7
Type:
Small organic molecule
Emp. Form.:
C29H28F2N6O2
Mol. Mass.:
530.5684
SMILES:
CN1CCC(Oc2cccc3ncnc(Nc4ccc(Oc5ccc6n(C)cnc6c5)c(C)c4)c23)C(F)(F)C1
: