Target
Receptor tyrosine-protein kinase erbB-2
Ligand
BDBM471602
Substrate
Meas. Tech.
Inhibition Assay
IC50
19.7±n/a nM
Citation
 Li, ZZhong, WWang, JZeng, QTsui, HYang, ZZhang, X ErbB receptor inhibitors US Patent  US10822334 Publication Date 11/3/2020 
Target
Name:
Receptor tyrosine-protein kinase erbB-2
Synonyms:
2.7.10.1 CD_antigen=CD340 ERBB2_HUMAN FASN/HER2 HER2 MLN19 NEU Proto-oncogene Neu Tyrosine kinase-type cell surface receptor HER2 | p185erbB2
Type:
Mol. Mass.:
137894.47
Organism:
Homo sapiens (Human)
Description:
P04626
Residue:
1255
  
Inhibitor
Name:
BDBM471602
Synonyms:
US10822334, Compound 14
Type:
Small organic molecule
Emp. Form.:
C28H26F3N7O3
Mol. Mass.:
565.5463
SMILES:
COc1cc(O[C@H]2CCN(C)CC2(F)F)c2c(Nc3cc(C)c(Oc4ccn5ncnc5c4)cc3F)ncnc2c1
: