Target
Adenosine receptor A2a
Ligand
BDBM471624
Substrate
Meas. Tech.
Competition Binding Assay
Ki
29.0±n/a nM
Citation
 Ali, AHuang, XLim, YKuang, RWu, HAnand, RYu, YMetzger, EMan-Chu Lo, MTing, PCStamford, AWTempest, P Substituted aminoquinazoline compounds as A2A antagonist US Patent  US10822338 Publication Date 11/3/2020 
Target
Name:
Adenosine receptor A2a
Synonyms:
A2A adenosine receptor (hA2A) ADENOSINE A2 ADORA2 Adenosine A2A receptor (A2AAR)
Type:
G Protein-Coupled Receptor (GPCR)
Mol. Mass.:
44716.46
Organism:
Homo sapiens (Human)
Description:
P29274
Residue:
412
  
Inhibitor
Name:
BDBM471624
Synonyms:
(R)-2-(1-butylpiperidin-3- yl)-7-methoxy- [1,2,4]triazolo[1,5- c]quinazolin-5-amine | US10822338, Example 7
Type:
Small organic molecule
Emp. Form.:
C19H26N6O
Mol. Mass.:
354.4493
SMILES:
CCCCN1CCC[C@H](C1)c1nc2c3cccc(OC)c3nc(N)n2n1
: