Target
Adenosine receptor A2a
Ligand
BDBM471686
Substrate
Meas. Tech.
Competition Binding Assay
Ki
55.0±n/a nM
Citation
 Ali, AHuang, XLim, YKuang, RWu, HAnand, RYu, YMetzger, EMan-Chu Lo, MTing, PCStamford, AWTempest, P Substituted aminoquinazoline compounds as A2A antagonist US Patent  US10822338 Publication Date 11/3/2020 
Target
Name:
Adenosine receptor A2a
Synonyms:
A2A adenosine receptor (hA2A) ADENOSINE A2 ADORA2 Adenosine A2A receptor (A2AAR)
Type:
G Protein-Coupled Receptor (GPCR)
Mol. Mass.:
44716.46
Organism:
Homo sapiens (Human)
Description:
P29274
Residue:
412
  
Inhibitor
Name:
BDBM471686
Synonyms:
US10822338, Example 56B
Type:
Small organic molecule
Emp. Form.:
C18H17F5N6O2
Mol. Mass.:
444.3586
SMILES:
Nc1nc2c3OC(F)(F)Oc3ccc2c2nc(nn12)[C@@H]1CCCN(CCC(F)(F)F)C1
: