Target
Non-receptor tyrosine-protein kinase TYK2
Ligand
BDBM471706
Substrate
Meas. Tech.
Caliper Enzyme Assay
IC50
81.0±n/a nM
Citation
 Brown, MFDermenci, AFensome, AGerstenberger, BSHayward, MMOwen, DRWright, SWXing, LHYang, X Pyrazolo[1,5-a]pyrazin-4-yl derivatives US Patent  US10822341 Publication Date 11/3/2020 
Target
Name:
Non-receptor tyrosine-protein kinase TYK2
Synonyms:
Non-receptor tyrosine-protein kinase TYK2 (TYK2) TYK2_HUMAN | Tyrosine-protein kinase TYK2
Type:
Protein
Mol. Mass.:
133666.03
Organism:
Homo sapiens (Human)
Description:
P29597
Residue:
1187
  
Inhibitor
Name:
BDBM471706
Synonyms:
2-((1r,3s)-3-Hydroxy-1-(4-(6-(1-methyl-1H-pyrazol-4-yl)pyrazolo[1,5-a]pyrazin-4-yl)-1H-pyrazol-1-yl)cyclobutyl)acetonitrile | US10822341, Example 14
Type:
Small organic molecule
Emp. Form.:
C19H18N8O
Mol. Mass.:
374.3992
SMILES:
Cn1cc(cn1)-c1cn2nccc2c(n1)-c1cnn(c1)C1(CC#N)CC(O)C1
: