Target
Tyrosine-protein kinase JAK1
Ligand
BDBM305822
Substrate
Meas. Tech.
Caliper Enzyme Assay
IC50
1288±n/a nM
Citation
 Brown, MFDermenci, AFensome, AGerstenberger, BSHayward, MMOwen, DRWright, SWXing, LHYang, X Pyrazolo[1,5-a]pyrazin-4-yl derivatives US Patent  US10822341 Publication Date 11/3/2020 
Target
Name:
Tyrosine-protein kinase JAK1
Synonyms:
JAK-1 JAK1A JAK1_HUMAN Janus kinase 1 (JAK1) | Janus kinase 1 JAK1
Type:
Protein
Mol. Mass.:
133293.73
Organism:
Homo sapiens (Human)
Description:
P23458
Residue:
1154
  
Inhibitor
Name:
BDBM305822
Synonyms:
(1r,3r)-3-(Cyanomethyl)-3-(3-methyl-4-(6-(1-methyl-1H-pyrazol-4-yl)pyrazolo[1,5-a]pyrazin-4-yl)-1H-pyrazol-1-yl)cyclobutane-1-carbonitrile US10822341, Example 21 | US11472809, Example 21
Type:
Small organic molecule
Emp. Form.:
C21H19N9
Mol. Mass.:
397.4359
SMILES:
Cc1nn(cc1-c1nc(cn2nccc12)-c1cnn(C)c1)[C@@]1(CC#N)C[C@@H](C1)C#N
: