Target
Non-receptor tyrosine-protein kinase TYK2
Ligand
BDBM305823
Substrate
Meas. Tech.
Caliper Enzyme Assay
IC50
30.0±n/a nM
Citation
 Brown, MFDermenci, AFensome, AGerstenberger, BSHayward, MMOwen, DRWright, SWXing, LHYang, X Pyrazolo[1,5-a]pyrazin-4-yl derivatives US Patent  US10822341 Publication Date 11/3/2020 
Target
Name:
Non-receptor tyrosine-protein kinase TYK2
Synonyms:
Non-receptor tyrosine-protein kinase TYK2 (TYK2) TYK2_HUMAN | Tyrosine-protein kinase TYK2
Type:
Protein
Mol. Mass.:
133666.03
Organism:
Homo sapiens (Human)
Description:
P29597
Residue:
1187
  
Inhibitor
Name:
BDBM305823
Synonyms:
(1r,3r)-3-(Cyanomethyl)-3-(4-(6-(3-(hydroxymethyl)-1-methyl-1H-pyrazol-4-yl)pyrazolo[1,5-a]pyrazin-4-yl)-1H-pyrazol-1-yl)cyclobutane-1-carbonitrile US10822341, Example 22 | US11472809, Example 22
Type:
Small organic molecule
Emp. Form.:
C21H19N9O
Mol. Mass.:
413.4353
SMILES:
Cn1cc(c(CO)n1)-c1cn2nccc2c(n1)-c1cnn(c1)[C@@]1(CC#N)C[C@@H](C1)C#N
: