Target
Tyrosine-protein kinase JAK2
Ligand
BDBM305826
Substrate
Meas. Tech.
Caliper Enzyme Assay
IC50
99.0±n/a nM
Citation
 Brown, MFDermenci, AFensome, AGerstenberger, BSHayward, MMOwen, DRWright, SWXing, LHYang, X Pyrazolo[1,5-a]pyrazin-4-yl derivatives US Patent  US10822341 Publication Date 11/3/2020 
Target
Name:
Tyrosine-protein kinase JAK2
Synonyms:
JAK-2 JAK2_HUMAN Janus kinase 2 (JAK2) | Janus kinase 2 (a protein tyrosine kinase)
Type:
Protein
Mol. Mass.:
130684.68
Organism:
Homo sapiens (Human)
Description:
O60674
Residue:
1132
  
Inhibitor
Name:
BDBM305826
Synonyms:
(1r,3r)-3-(Cyanomethyl)-3-(4-(3-methyl-6-(1-methyl-1H-pyrazol-4-yl)pyrazolo[1,5-a]pyrazin-4-yl)-1H-pyrazol-1-yl)cyclobutane-1-carbonitrile US10822341, Example 25 | US11472809, Example 25
Type:
Small organic molecule
Emp. Form.:
C21H19N9
Mol. Mass.:
397.4359
SMILES:
Cc1cnn2cc(nc(-c3cnn(c3)[C@@]3(CC#N)C[C@@H](C3)C#N)c12)-c1cnn(C)c1
: